{"text_format":"1","workbook":"xlsx","n_sheets":5,"sheets":["Worksheet","Measure Code","Table","Export","Version"],"not_rendered":{"charts":0,"images":0,"macros":1,"external_links":0,"defined_names":11,"comments":0,"pivot_tables":0},"unopened":[],"bounds":{"document_bytes":16777216,"sheet_cells":100000,"rows_first":2000,"rows_last":500,"rows_between":2000,"halvings":0,"cell_chars":16384,"cell_head_chars":4096},"cells_cut":0,"cells_raw":0,"read":"whole","date_system":"1900"}

{"sheet":"Worksheet","index":0,"n_rows":40,"n_cols":25,"rows_kept":40,"cut":false,"hidden":false,"merged":[[13,6,13,8],[3,6,3,10],[0,0,0,3],[3,13,3,14],[2,13,2,14],[7,6,7,10],[13,2,13,3],[8,2,8,3],[7,2,7,3],[5,2,5,4],[3,2,3,4],[4,2,4,4],[8,6,8,8],[9,22,9,24],[2,21,2,23],[3,21,7,23],[2,24,2,26],[3,24,7,26]]}
["FY23 SmartStart New Construction - Gas Heating v1.1",null,null,null,"Incentive amounts below are estimates until verified by the Program Manager."]
[]
["Customer Information",null,null,null,null,null,null,null,null,null,null,null,null,"Total Units Committed:",null,{"$f":"SUM(N16:N40)","v":0},null,null,null,null,null,"Pre-Inspection Notes",null,null,"Post-Inspection Notes"]
["Company",null,null,null,null,"Address",null,null,null,null,null,null,null,"Total Units Installed:",null,{"$f":"SUM(O16:O40)","v":0}]
["Application",null,null,null,null,"Date"]
["Contact"]
["Contractor/Vendor Information"]
["Company",null,null,null,null,"Address"]
["Contact",null,null,null," ","Phone"]
["Enhanced Incentive Eligibility",null,null,null,null,null,null,null,null,null,null,null,null,null,null,null,null,null,null,null,null,"Inspection Type"]
{"$rows_left_out":31}
{"sheet":"Measure Code","index":1,"n_rows":33,"n_cols":10,"rows_kept":33,"cut":false,"hidden":true,"merged":[]}
["Measure Code","Type","Boiler Type","Min Capacity (MBH)","Max Capacity (MBH)","Min Eligible Efficiency","Efficiency Units","Incentive $/MBH","Min Incentive per Unit","Measure Life"]
["GH1","Hot Water Boiler","Non-Condensing",0.01,299.99,0.85,"AFUE",0.95,400,20]
["GH2","Hot Water Boiler","Non-Condensing",300,1500,0.85,"Et",1.75,0,20]
["GH3","Hot Water Boiler","Non-Condensing",1500.01,2500,0.85,"Et",1.5,0,20]
["GH4","Hot Water Boiler","Non-Condensing",2500.0100000000002,4000,0.85,"Ec",1.3,0,20]
["GH5","Steam Boiler","Non-Natural Draft",0.01,299.99,0.82,"AFUE",1.4,400,20]
["GH6","Steam Boiler","Non-Natural Draft",300,1500,0.81,"Et",1.2,0,20]
["GH7","Steam Boiler","Non-Natural Draft",1500.01,2500,0.81,"Et",1.2,0,20]
["GH8","Steam Boiler","Non-Natural Draft",2500.0100000000002,4000,0.81,"Et",1,0,20]
["GH9","Steam Boiler","Natural Draft",0.01,299.99,0.82,"AFUE",1.4,300,20]
{"$rows_left_out":24}
{"sheet":"Table","index":2,"n_rows":29,"n_cols":12,"rows_kept":29,"cut":false,"hidden":true,"merged":[[0,3,0,8],[7,3,7,8],[15,3,16,3],[15,4,15,7],[14,3,14,7]]}
["Facility Type","Heating EFLH",null,"Boiler/Furnace Baseline Efficiencies",null,null,null,null,null,null,"Types"]
["Assembly",603,null,"MBH","Hot Water Boiler: Non-Condensing","Hot Water Boiler: Condensing","Steam Boiler: Non-Natural Draft","Steam Boiler: Natural Draft","Furnace: N/A",null,"Boiler Fuel EconomizerN/A",274]
["Auto repair",1910,null,0,0.82,0.82,0.8,0.8,0.78,null,"Boiler Fuel EconomizerN/A",275]
["Dormitory",465,null,225,0.82,0.82,0.8,0.8,0.8,null,"FurnaceN/A",11]
["Hospital",3366,null,300,0.8,0.8,0.79,0.77,0.8,null,"Hot Water BoilerCondensing",81]
["Light industrial",714,null,2500,0.82,0.82,0.79,0.77,0.8,null,"Hot Water BoilerNon-Condensing",81]
["Lodging – Hotel",1077,null,null,null,null,null,null,null,null,"Infrared HeaterN/A",240]
["Lodging – Motel",619,null,"Boiler/Furnace Efficiency Units",null,null,null,null,null,null,"Steam BoilerNatural Draft",82]
["Office – large",2034,null,"MBH","Hot Water Boiler: Non-Condensing","Hot Water Boiler: Condensing","Steam Boiler: Non-Natural Draft","Steam Boiler: Natural Draft","Furnace: N/A",null,"Steam BoilerNon-Natural Draft",82]
["Office – small",431,null,0,"AFUE","AFUE","AFUE","AFUE","AFUE",null,"Pipe Wrap InsulationN/A",243]
{"$rows_left_out":20}
{"sheet":"Export","index":3,"n_rows":26,"n_cols":25,"rows_kept":26,"cut":false,"hidden":true,"merged":[]}
["Measure Type","Manufacturer","Model","Capacity/Size","Capacity/Size Units","EER Efficiency","SEER Efficiency","Incentive Per Unit","Quantity Committed","Annual Electricity Savings","Peak Demand Reduction","Lifetime Electricity Savings","Annual Gas Savings","Lifetime Gas Savings","Efficiency- other","Efficiency- other-type","Measure ID removed","Quantity Installed","Project in UEZ","Project in OZ","Municipality","K-12 School","County","Affordable Housing","Enhanced Incentive per Unit"]
[{"$f":"IFERROR(VLOOKUP(CONCATENATE(Worksheet!C16,Worksheet!F16),Table!$K$2:$L$10,2,FALSE),\"\")","v":""},{"$f":"IF(ISBLANK(Worksheet!D16) = FALSE,Worksheet!D16,\"\")","v":""},{"$f":"IF(ISBLANK(Worksheet!E16) = FALSE,Worksheet!E16,\"\")","v":""},{"$f":"IF(OR(Worksheet!A16=\"GH30\",Worksheet!A16=\"GH31\")=TRUE,IF(Worksheet!M16=\"\",\"\",Worksheet!M16),IF(Worksheet!G16=\"\",\"\",Worksheet!G16))","v":""},{"$f":"IF(OR(Worksheet!A16=\"GH30\",Worksheet!A16=\"GH31\")=TRUE,\"Inches\",\"MBh\")","v":"MBh"},null,null,{"$f":"IF(ISBLANK(Worksheet!P16) = FALSE,Worksheet!P16,\"\")","v":0},{"$f":"IF(ISBLANK(Worksheet!N16) = FALSE,Worksheet!N16,\"\")","v":""},null,null,null,{"$f":"IF(ISBLANK(Worksheet!N16)=FALSE,Worksheet!T16/Worksheet!N16,\"\")","v":""},{"$f":"IF(ISBLANK(Worksheet!N16)=FALSE,Worksheet!V16/Worksheet!N16,\"\")","v":""},{"$f":"IF(ISBLANK(Worksheet!J16) = FALSE,Worksheet!J16,\"\")","v":""},{"$f":"Worksheet!K16","v":""},null,{"$f":"IF(ISBLANK(Worksheet!O16) = FALSE,Worksheet!O16,\"\")","v":""},{"$f":"IF(Worksheet!$A$11=TRUE,\"Y\",\"N\")","v":"N"},{"$f":"IF(Worksheet!$A$12=TRUE,\"Y\",\"N\")","v":"N"},{"$f":"IF(Worksheet!$C$11=TRUE,\"Y\",\"N\")","v":"N"},{"$f":"IF(Worksheet!$C$12=TRUE,\"Y\",\"N\")","v":"N"},{"$f":"IF(Worksheet!$D$11=TRUE,\"Y\",\"N\")","v":"N"},{"$f":"IF(Worksheet!$D$12=TRUE,\"Y\",\"N\")","v":"N"},{"$f":"IFERROR(Worksheet!Q16,\"\")","v":0}]
[{"$f":"IFERROR(VLOOKUP(CONCATENATE(Worksheet!C17,Worksheet!F17),Table!$K$2:$L$10,2,FALSE),\"\")","v":""},{"$f":"IF(ISBLANK(Worksheet!D17) = FALSE,Worksheet!D17,\"\")","v":""},{"$f":"IF(ISBLANK(Worksheet!E17) = FALSE,Worksheet!E17,\"\")","v":""},{"$f":"IF(OR(Worksheet!A17=\"GH30\",Worksheet!A17=\"GH31\")=TRUE,IF(Worksheet!M17=\"\",\"\",Worksheet!M17),IF(Worksheet!G17=\"\",\"\",Worksheet!G17))","v":""},{"$f":"IF(OR(Worksheet!A17=\"GH30\",Worksheet!A17=\"GH31\")=TRUE,\"Inches\",\"MBh\")","v":"MBh"},null,null,{"$f":"IF(ISBLANK(Worksheet!P17) = FALSE,Worksheet!P17,\"\")","v":0},{"$f":"IF(ISBLANK(Worksheet!N17) = FALSE,Worksheet!N17,\"\")","v":""},null,null,null,{"$f":"IF(ISBLANK(Worksheet!N17)=FALSE,Worksheet!T17/Worksheet!N17,\"\")","v":""},{"$f":"IF(ISBLANK(Worksheet!N17)=FALSE,Worksheet!V17/Worksheet!N17,\"\")","v":""},{"$f":"IF(ISBLANK(Worksheet!J17) = FALSE,Worksheet!J17,\"\")","v":""},{"$f":"Worksheet!K17","v":""},null,{"$f":"IF(ISBLANK(Worksheet!O17) = FALSE,Worksheet!O17,\"\")","v":""},{"$f":"IF(Worksheet!$A$11=TRUE,\"Y\",\"N\")","v":"N"},{"$f":"IF(Worksheet!$A$12=TRUE,\"Y\",\"N\")","v":"N"},{"$f":"IF(Worksheet!$C$11=TRUE,\"Y\",\"N\")","v":"N"},{"$f":"IF(Worksheet!$C$12=TRUE,\"Y\",\"N\")","v":"N"},{"$f":"IF(Worksheet!$D$11=TRUE,\"Y\",\"N\")","v":"N"},{"$f":"IF(Worksheet!$D$12=TRUE,\"Y\",\"N\")","v":"N"},{"$f":"IFERROR(Worksheet!Q17,\"\")","v":0}]
[{"$f":"IFERROR(VLOOKUP(CONCATENATE(Worksheet!C18,Worksheet!F18),Table!$K$2:$L$10,2,FALSE),\"\")","v":""},{"$f":"IF(ISBLANK(Worksheet!D18) = FALSE,Worksheet!D18,\"\")","v":""},{"$f":"IF(ISBLANK(Worksheet!E18) = FALSE,Worksheet!E18,\"\")","v":""},{"$f":"IF(OR(Worksheet!A18=\"GH30\",Worksheet!A18=\"GH31\")=TRUE,IF(Worksheet!M18=\"\",\"\",Worksheet!M18),IF(Worksheet!G18=\"\",\"\",Worksheet!G18))","v":""},{"$f":"IF(OR(Worksheet!A18=\"GH30\",Worksheet!A18=\"GH31\")=TRUE,\"Inches\",\"MBh\")","v":"MBh"},null,null,{"$f":"IF(ISBLANK(Worksheet!P18) = FALSE,Worksheet!P18,\"\")","v":0},{"$f":"IF(ISBLANK(Worksheet!N18) = FALSE,Worksheet!N18,\"\")","v":""},null,null,null,{"$f":"IF(ISBLANK(Worksheet!N18)=FALSE,Worksheet!T18/Worksheet!N18,\"\")","v":""},{"$f":"IF(ISBLANK(Worksheet!N18)=FALSE,Worksheet!V18/Worksheet!N18,\"\")","v":""},{"$f":"IF(ISBLANK(Worksheet!J18) = FALSE,Worksheet!J18,\"\")","v":""},{"$f":"Worksheet!K18","v":""},null,{"$f":"IF(ISBLANK(Worksheet!O18) = FALSE,Worksheet!O18,\"\")","v":""},{"$f":"IF(Worksheet!$A$11=TRUE,\"Y\",\"N\")","v":"N"},{"$f":"IF(Worksheet!$A$12=TRUE,\"Y\",\"N\")","v":"N"},{"$f":"IF(Worksheet!$C$11=TRUE,\"Y\",\"N\")","v":"N"},{"$f":"IF(Worksheet!$C$12=TRUE,\"Y\",\"N\")","v":"N"},{"$f":"IF(Worksheet!$D$11=TRUE,\"Y\",\"N\")","v":"N"},{"$f":"IF(Worksheet!$D$12=TRUE,\"Y\",\"N\")","v":"N"},{"$f":"IFERROR(Worksheet!Q18,\"\")","v":0}]
[{"$f":"IFERROR(VLOOKUP(CONCATENATE(Worksheet!C19,Worksheet!F19),Table!$K$2:$L$10,2,FALSE),\"\")","v":""},{"$f":"IF(ISBLANK(Worksheet!D19) = FALSE,Worksheet!D19,\"\")","v":""},{"$f":"IF(ISBLANK(Worksheet!E19) = FALSE,Worksheet!E19,\"\")","v":""},{"$f":"IF(OR(Worksheet!A19=\"GH30\",Worksheet!A19=\"GH31\")=TRUE,IF(Worksheet!M19=\"\",\"\",Worksheet!M19),IF(Worksheet!G19=\"\",\"\",Worksheet!G19))","v":""},{"$f":"IF(OR(Worksheet!A19=\"GH30\",Worksheet!A19=\"GH31\")=TRUE,\"Inches\",\"MBh\")","v":"MBh"},null,null,{"$f":"IF(ISBLANK(Worksheet!P19) = FALSE,Worksheet!P19,\"\")","v":0},{"$f":"IF(ISBLANK(Worksheet!N19) = FALSE,Worksheet!N19,\"\")","v":""},null,null,null,{"$f":"IF(ISBLANK(Worksheet!N19)=FALSE,Worksheet!T19/Worksheet!N19,\"\")","v":""},{"$f":"IF(ISBLANK(Worksheet!N19)=FALSE,Worksheet!V19/Worksheet!N19,\"\")","v":""},{"$f":"IF(ISBLANK(Worksheet!J19) = FALSE,Worksheet!J19,\"\")","v":""},{"$f":"Worksheet!K19","v":""},null,{"$f":"IF(ISBLANK(Worksheet!O19) = FALSE,Worksheet!O19,\"\")","v":""},{"$f":"IF(Worksheet!$A$11=TRUE,\"Y\",\"N\")","v":"N"},{"$f":"IF(Worksheet!$A$12=TRUE,\"Y\",\"N\")","v":"N"},{"$f":"IF(Worksheet!$C$11=TRUE,\"Y\",\"N\")","v":"N"},{"$f":"IF(Worksheet!$C$12=TRUE,\"Y\",\"N\")","v":"N"},{"$f":"IF(Worksheet!$D$11=TRUE,\"Y\",\"N\")","v":"N"},{"$f":"IF(Worksheet!$D$12=TRUE,\"Y\",\"N\")","v":"N"},{"$f":"IFERROR(Worksheet!Q19,\"\")","v":0}]
[{"$f":"IFERROR(VLOOKUP(CONCATENATE(Worksheet!C20,Worksheet!F20),Table!$K$2:$L$10,2,FALSE),\"\")","v":""},{"$f":"IF(ISBLANK(Worksheet!D20) = FALSE,Worksheet!D20,\"\")","v":""},{"$f":"IF(ISBLANK(Worksheet!E20) = FALSE,Worksheet!E20,\"\")","v":""},{"$f":"IF(OR(Worksheet!A20=\"GH30\",Worksheet!A20=\"GH31\")=TRUE,IF(Worksheet!M20=\"\",\"\",Worksheet!M20),IF(Worksheet!G20=\"\",\"\",Worksheet!G20))","v":""},{"$f":"IF(OR(Worksheet!A20=\"GH30\",Worksheet!A20=\"GH31\")=TRUE,\"Inches\",\"MBh\")","v":"MBh"},null,null,{"$f":"IF(ISBLANK(Worksheet!P20) = FALSE,Worksheet!P20,\"\")","v":0},{"$f":"IF(ISBLANK(Worksheet!N20) = FALSE,Worksheet!N20,\"\")","v":""},null,null,null,{"$f":"IF(ISBLANK(Worksheet!N20)=FALSE,Worksheet!T20/Worksheet!N20,\"\")","v":""},{"$f":"IF(ISBLANK(Worksheet!N20)=FALSE,Worksheet!V20/Worksheet!N20,\"\")","v":""},{"$f":"IF(ISBLANK(Worksheet!J20) = FALSE,Worksheet!J20,\"\")","v":""},{"$f":"Worksheet!K20","v":""},null,{"$f":"IF(ISBLANK(Worksheet!O20) = FALSE,Worksheet!O20,\"\")","v":""},{"$f":"IF(Worksheet!$A$11=TRUE,\"Y\",\"N\")","v":"N"},{"$f":"IF(Worksheet!$A$12=TRUE,\"Y\",\"N\")","v":"N"},{"$f":"IF(Worksheet!$C$11=TRUE,\"Y\",\"N\")","v":"N"},{"$f":"IF(Worksheet!$C$12=TRUE,\"Y\",\"N\")","v":"N"},{"$f":"IF(Worksheet!$D$11=TRUE,\"Y\",\"N\")","v":"N"},{"$f":"IF(Worksheet!$D$12=TRUE,\"Y\",\"N\")","v":"N"},{"$f":"IFERROR(Worksheet!Q20,\"\")","v":0}]
[{"$f":"IFERROR(VLOOKUP(CONCATENATE(Worksheet!C21,Worksheet!F21),Table!$K$2:$L$10,2,FALSE),\"\")","v":""},{"$f":"IF(ISBLANK(Worksheet!D21) = FALSE,Worksheet!D21,\"\")","v":""},{"$f":"IF(ISBLANK(Worksheet!E21) = FALSE,Worksheet!E21,\"\")","v":""},{"$f":"IF(OR(Worksheet!A21=\"GH30\",Worksheet!A21=\"GH31\")=TRUE,IF(Worksheet!M21=\"\",\"\",Worksheet!M21),IF(Worksheet!G21=\"\",\"\",Worksheet!G21))","v":""},{"$f":"IF(OR(Worksheet!A21=\"GH30\",Worksheet!A21=\"GH31\")=TRUE,\"Inches\",\"MBh\")","v":"MBh"},null,null,{"$f":"IF(ISBLANK(Worksheet!P21) = FALSE,Worksheet!P21,\"\")","v":0},{"$f":"IF(ISBLANK(Worksheet!N21) = FALSE,Worksheet!N21,\"\")","v":""},null,null,null,{"$f":"IF(ISBLANK(Worksheet!N21)=FALSE,Worksheet!T21/Worksheet!N21,\"\")","v":""},{"$f":"IF(ISBLANK(Worksheet!N21)=FALSE,Worksheet!V21/Worksheet!N21,\"\")","v":""},{"$f":"IF(ISBLANK(Worksheet!J21) = FALSE,Worksheet!J21,\"\")","v":""},{"$f":"Worksheet!K21","v":""},null,{"$f":"IF(ISBLANK(Worksheet!O21) = FALSE,Worksheet!O21,\"\")","v":""},{"$f":"IF(Worksheet!$A$11=TRUE,\"Y\",\"N\")","v":"N"},{"$f":"IF(Worksheet!$A$12=TRUE,\"Y\",\"N\")","v":"N"},{"$f":"IF(Worksheet!$C$11=TRUE,\"Y\",\"N\")","v":"N"},{"$f":"IF(Worksheet!$C$12=TRUE,\"Y\",\"N\")","v":"N"},{"$f":"IF(Worksheet!$D$11=TRUE,\"Y\",\"N\")","v":"N"},{"$f":"IF(Worksheet!$D$12=TRUE,\"Y\",\"N\")","v":"N"},{"$f":"IFERROR(Worksheet!Q21,\"\")","v":0}]
[{"$f":"IFERROR(VLOOKUP(CONCATENATE(Worksheet!C22,Worksheet!F22),Table!$K$2:$L$10,2,FALSE),\"\")","v":""},{"$f":"IF(ISBLANK(Worksheet!D22) = FALSE,Worksheet!D22,\"\")","v":""},{"$f":"IF(ISBLANK(Worksheet!E22) = FALSE,Worksheet!E22,\"\")","v":""},{"$f":"IF(OR(Worksheet!A22=\"GH30\",Worksheet!A22=\"GH31\")=TRUE,IF(Worksheet!M22=\"\",\"\",Worksheet!M22),IF(Worksheet!G22=\"\",\"\",Worksheet!G22))","v":""},{"$f":"IF(OR(Worksheet!A22=\"GH30\",Worksheet!A22=\"GH31\")=TRUE,\"Inches\",\"MBh\")","v":"MBh"},null,null,{"$f":"IF(ISBLANK(Worksheet!P22) = FALSE,Worksheet!P22,\"\")","v":0},{"$f":"IF(ISBLANK(Worksheet!N22) = FALSE,Worksheet!N22,\"\")","v":""},null,null,null,{"$f":"IF(ISBLANK(Worksheet!N22)=FALSE,Worksheet!T22/Worksheet!N22,\"\")","v":""},{"$f":"IF(ISBLANK(Worksheet!N22)=FALSE,Worksheet!V22/Worksheet!N22,\"\")","v":""},{"$f":"IF(ISBLANK(Worksheet!J22) = FALSE,Worksheet!J22,\"\")","v":""},{"$f":"Worksheet!K22","v":""},null,{"$f":"IF(ISBLANK(Worksheet!O22) = FALSE,Worksheet!O22,\"\")","v":""},{"$f":"IF(Worksheet!$A$11=TRUE,\"Y\",\"N\")","v":"N"},{"$f":"IF(Worksheet!$A$12=TRUE,\"Y\",\"N\")","v":"N"},{"$f":"IF(Worksheet!$C$11=TRUE,\"Y\",\"N\")","v":"N"},{"$f":"IF(Worksheet!$C$12=TRUE,\"Y\",\"N\")","v":"N"},{"$f":"IF(Worksheet!$D$11=TRUE,\"Y\",\"N\")","v":"N"},{"$f":"IF(Worksheet!$D$12=TRUE,\"Y\",\"N\")","v":"N"},{"$f":"IFERROR(Worksheet!Q22,\"\")","v":0}]
[{"$f":"IFERROR(VLOOKUP(CONCATENATE(Worksheet!C23,Worksheet!F23),Table!$K$2:$L$10,2,FALSE),\"\")","v":""},{"$f":"IF(ISBLANK(Worksheet!D23) = FALSE,Worksheet!D23,\"\")","v":""},{"$f":"IF(ISBLANK(Worksheet!E23) = FALSE,Worksheet!E23,\"\")","v":""},{"$f":"IF(OR(Worksheet!A23=\"GH30\",Worksheet!A23=\"GH31\")=TRUE,IF(Worksheet!M23=\"\",\"\",Worksheet!M23),IF(Worksheet!G23=\"\",\"\",Worksheet!G23))","v":""},{"$f":"IF(OR(Worksheet!A23=\"GH30\",Worksheet!A23=\"GH31\")=TRUE,\"Inches\",\"MBh\")","v":"MBh"},null,null,{"$f":"IF(ISBLANK(Worksheet!P23) = FALSE,Worksheet!P23,\"\")","v":0},{"$f":"IF(ISBLANK(Worksheet!N23) = FALSE,Worksheet!N23,\"\")","v":""},null,null,null,{"$f":"IF(ISBLANK(Worksheet!N23)=FALSE,Worksheet!T23/Worksheet!N23,\"\")","v":""},{"$f":"IF(ISBLANK(Worksheet!N23)=FALSE,Worksheet!V23/Worksheet!N23,\"\")","v":""},{"$f":"IF(ISBLANK(Worksheet!J23) = FALSE,Worksheet!J23,\"\")","v":""},{"$f":"Worksheet!K23","v":""},null,{"$f":"IF(ISBLANK(Worksheet!O23) = FALSE,Worksheet!O23,\"\")","v":""},{"$f":"IF(Worksheet!$A$11=TRUE,\"Y\",\"N\")","v":"N"},{"$f":"IF(Worksheet!$A$12=TRUE,\"Y\",\"N\")","v":"N"},{"$f":"IF(Worksheet!$C$11=TRUE,\"Y\",\"N\")","v":"N"},{"$f":"IF(Worksheet!$C$12=TRUE,\"Y\",\"N\")","v":"N"},{"$f":"IF(Worksheet!$D$11=TRUE,\"Y\",\"N\")","v":"N"},{"$f":"IF(Worksheet!$D$12=TRUE,\"Y\",\"N\")","v":"N"},{"$f":"IFERROR(Worksheet!Q23,\"\")","v":0}]
[{"$f":"IFERROR(VLOOKUP(CONCATENATE(Worksheet!C24,Worksheet!F24),Table!$K$2:$L$10,2,FALSE),\"\")","v":""},{"$f":"IF(ISBLANK(Worksheet!D24) = FALSE,Worksheet!D24,\"\")","v":""},{"$f":"IF(ISBLANK(Worksheet!E24) = FALSE,Worksheet!E24,\"\")","v":""},{"$f":"IF(OR(Worksheet!A24=\"GH30\",Worksheet!A24=\"GH31\")=TRUE,IF(Worksheet!M24=\"\",\"\",Worksheet!M24),IF(Worksheet!G24=\"\",\"\",Worksheet!G24))","v":""},{"$f":"IF(OR(Worksheet!A24=\"GH30\",Worksheet!A24=\"GH31\")=TRUE,\"Inches\",\"MBh\")","v":"MBh"},null,null,{"$f":"IF(ISBLANK(Worksheet!P24) = FALSE,Worksheet!P24,\"\")","v":0},{"$f":"IF(ISBLANK(Worksheet!N24) = FALSE,Worksheet!N24,\"\")","v":""},null,null,null,{"$f":"IF(ISBLANK(Worksheet!N24)=FALSE,Worksheet!T24/Worksheet!N24,\"\")","v":""},{"$f":"IF(ISBLANK(Worksheet!N24)=FALSE,Worksheet!V24/Worksheet!N24,\"\")","v":""},{"$f":"IF(ISBLANK(Worksheet!J24) = FALSE,Worksheet!J24,\"\")","v":""},{"$f":"Worksheet!K24","v":""},null,{"$f":"IF(ISBLANK(Worksheet!O24) = FALSE,Worksheet!O24,\"\")","v":""},{"$f":"IF(Worksheet!$A$11=TRUE,\"Y\",\"N\")","v":"N"},{"$f":"IF(Worksheet!$A$12=TRUE,\"Y\",\"N\")","v":"N"},{"$f":"IF(Worksheet!$C$11=TRUE,\"Y\",\"N\")","v":"N"},{"$f":"IF(Worksheet!$C$12=TRUE,\"Y\",\"N\")","v":"N"},{"$f":"IF(Worksheet!$D$11=TRUE,\"Y\",\"N\")","v":"N"},{"$f":"IF(Worksheet!$D$12=TRUE,\"Y\",\"N\")","v":"N"},{"$f":"IFERROR(Worksheet!Q24,\"\")","v":0}]
{"$rows_left_out":17}
{"sheet":"Version","index":4,"n_rows":17,"n_cols":3,"rows_kept":17,"cut":false,"hidden":true,"merged":[]}
["Version",null,"Protocol"]
[14,null,"FY21"]
["Log"]
["2007-10-02",null,"Added project information in rows 5-9"]
["2007-10-16",null,"Added manufacturer and model number"]
["2007-01-08",null,"No changes for new protocol"]
["2008-12-01",null,"Updated for compatability with measure tracking"]
["2012-01-13","V5","addition of infrared gas heaters and fuel use economizers for boilers"]
["2012-07-11","V6","Updated efficiency from >= 92 to 95 as per 2012 gas heating incentive cap for gas furnace applications"]
["2013-07-09","V7","no change for V7, skipped V6.. Strange that it is mentioned above"]
{"$rows_left_out":7}