{"text_format":"1","workbook":"xlsx","n_sheets":7,"sheets":["Worksheet","Measure Code","electric cooking device list","Incentive Structure","Building Type","Export","Version"],"not_rendered":{"charts":0,"images":0,"macros":1,"external_links":0,"defined_names":31,"comments":0,"pivot_tables":0},"unopened":[],"bounds":{"document_bytes":16777216,"sheet_cells":100000,"rows_first":2000,"rows_last":500,"rows_between":2000,"halvings":0,"cell_chars":16384,"cell_head_chars":4096},"cells_cut":0,"cells_raw":0,"read":"whole","date_system":"1900"}

{"sheet":"Worksheet","index":0,"n_rows":38,"n_cols":47,"rows_kept":38,"cut":false,"hidden":false,"merged":[[0,0,0,2],[4,34,4,36],[5,31,8,33],[5,34,8,36],[2,32,2,33],[4,31,4,33],[7,1,7,2],[7,5,7,8],[2,1,2,3],[2,5,2,12],[6,1,6,2],[6,5,6,12],[4,1,4,3],[3,1,3,3]]}
["FY22 SmartStart New Construction - Food Service Equipment v1.0",null,null,"Incentive amounts are estimates until verified by the Program Manager."]
["Customer Information",null,null,null,null,null,null,null,null,null,null,null,null,null,null,null,null,null,null,null,null,null,"Total Units Committed:",null,null,{"$f":"SUM($X14:$X38)","v":0}]
["Name",null,null,null,"Address",null,null,null,null,null,null,null,null,null,null,null,null,null,null,null,null,null,"Total Units Installed:",null,null,{"$f":"SUM($Y14:$Y38)","v":0},null,null,null,null,null,"Inspection Type"]
["Application",null,null,null,"Date"]
["Contact",null,null,null,null,null,null,null,null,null,null,null,null,null,null,null,null,null,null,null,null,null,null,null,null,null,null,null,null,null,null,"Pre-Inspection Notes",null,null,"Post-Inspection Notes"]
["Contractor/Vendor Information"]
["Name",null,null,null,"Address"]
["Contact",null,null," ","Phone"]
["Enhanced Incentive Eligibility"]
[false,false,false]
{"$rows_left_out":29}
{"sheet":"Measure Code","index":1,"n_rows":58,"n_cols":5,"rows_kept":58,"cut":false,"hidden":true,"merged":[]}
["Measure Code","Incentive Category","Incentive Subcategory","Description","Measure ID in DB"]
["FOOD1","Cooking","Combination Oven Steamer Electric","Combination Oven Steamer Electric - <15 Pans",1404]
["FOOD2","Cooking","Combination Oven Steamer Electric","Combination Oven Steamer Electric - 15 to 28 pans",1404]
["FOOD3","Cooking","Combination Oven Steamer Electric","Combination Oven Steamer Electric - >28 Pans",1404]
["FOOD4","Cooking","Combination Oven Steamer Natural Gas","Combination Oven Steamer Natural Gas - <15 Pans",1405]
["FOOD5","Cooking","Combination Oven Steamer Natural Gas","Combination Oven Steamer Natural Gas - 15 to 28 pans",1405]
["FOOD6","Cooking","Combination Oven Steamer Natural Gas","Combination Oven Steamer Natural Gas - >28 Pans",1405]
["FOOD7","Cooling","Glass Door Refrigerators","Energy Star - Internal Volume <15 CF",1406]
["FOOD8","Cooling","Glass Door Refrigerators","Energy Star - Internal Volume 15-29.9 CF",1406]
["FOOD9","Cooling","Glass Door Refrigerators","Energy Star - Internal Volume 30-49.9 CF",1406]
{"$rows_left_out":49}
{"sheet":"electric cooking device list","index":2,"n_rows":10,"n_cols":8,"rows_kept":10,"cut":false,"hidden":true,"merged":[]}
[]
[null,null,null,null,null,null,"equivalent max btuh","kW"]
[null,"FOOD1","Cooking","Combination Oven Steamer Electric","Combination Oven Steamer Electric - <15 Pans",1404,{"$f":"200*15+6511","v":9511},{"$f":"((G3-6511)/200)*0.133+0.64","v":2.6350000000000002}]
[null,"FOOD2","Cooking","Combination Oven Steamer Electric","Combination Oven Steamer Electric - 15 to 28 pans",1404,{"$f":"200*28+6511","v":12111},{"$f":"((G4-6511)/200)*0.133+0.64","v":4.3639999999999999}]
[null,"FOOD3","Cooking","Combination Oven Steamer Electric","Combination Oven Steamer Electric - >28 Pans",1404,{"$f":"200*29+6511","v":12311},4.4969999999999999]
[null,"FOOD37","Cooking","Convection Oven Electric","Convection Oven Electric",1398,12000,1.6]
[null,"FOOD43","Cooking","Fryer Electric","Fryer Electric",1392,9000,0.8]
[null,"FOOD45","Cooking","Large Vat Fryer Electric","Large Vat Fryer Electric",1392,12000,1.1000000000000001]
[null,"FOOD47","Cooking","Griddle Electric","Griddle Electric",1394,2650,0.35499999999999998]
[null,"FOOD49","Cooking","Steam Cooker Electric","Steam Cooker Electric",1402,6250,0.4]
{"$rows_left_out":1}
{"sheet":"Incentive Structure","index":3,"n_rows":60,"n_cols":15,"rows_kept":60,"cut":false,"hidden":true,"merged":[[2,11,2,14],[1,1,1,9]]}
[]
[null,"Food Service Equipment Incentives"]
[null,"Category","Subcategory","Measure ID",null,"Subcategory","Description","Key","Incentive","Unit Measure",null,"TEST"]
[null,"Cooking","Combination Oven Steamer Electric",1404,null,"Combination Oven Steamer Electric","Combination Oven Steamer Electric - <15 Pans",{"$f":"C4&G4","v":"Combination Oven Steamer ElectricCombination Oven Steamer Electric - <15 Pans"},1000,"oven",null,"Cooking","Convection Oven Natural Gas","Convection Oven Natural Gas",{"$f":"VLOOKUP(N4,G4:J56,2,0)","v":"Convection Oven Natural GasConvection Oven Natural Gas"}]
[null,"Cooking","Combination Oven Steamer Natural Gas",1405,null,"Combination Oven Steamer Electric","Combination Oven Steamer Electric - 15 to 28 pans",{"$f":"C4&G5","v":"Combination Oven Steamer ElectricCombination Oven Steamer Electric - 15 to 28 pans"},1000,"oven"]
[null,"Cooking","Convection Oven Electric",1398,null,"Combination Oven Steamer Electric","Combination Oven Steamer Electric - >28 Pans",{"$f":"C4&G6","v":"Combination Oven Steamer ElectricCombination Oven Steamer Electric - >28 Pans"},1000,"oven"]
[null,"Cooking","Convection Oven Natural Gas",1399,null,"Combination Oven Steamer Natural Gas","Combination Oven Steamer Natural Gas - <15 Pans",{"$f":"C5&G7","v":"Combination Oven Steamer Natural GasCombination Oven Steamer Natural Gas - <15 Pans"},750,"oven"]
[null,"Cooking","Rack Oven Natural Gas",1400,null,"Combination Oven Steamer Natural Gas","Combination Oven Steamer Natural Gas - 15 to 28 pans",{"$f":"C5&G8","v":"Combination Oven Steamer Natural GasCombination Oven Steamer Natural Gas - 15 to 28 pans"},750,"oven",null,"Cooling","Glass Door Freezers","Energy Star - Internal Volume 15-29.9 CF",{"$f":"VLOOKUP(N8,G8:J60,2,0)","v":"Glass Door RefrigeratorsEnergy Star - Internal Volume 15-29.9 CF"}]
[null,"Cooking","Conveyor Oven Natural Gas",1401,null,"Combination Oven Steamer Natural Gas","Combination Oven Steamer Natural Gas - >28 Pans",{"$f":"C5&G9","v":"Combination Oven Steamer Natural GasCombination Oven Steamer Natural Gas - >28 Pans"},750,"oven"]
[null,"Cooking","Fryer Electric",1392,null,"Convection Oven Electric","Convection Oven Electric",{"$f":"C6&Convection_Oven_Electric","v":"Convection Oven ElectricConvection Oven Electric"},350,"oven"]
{"$rows_left_out":51}
{"sheet":"Building Type","index":4,"n_rows":24,"n_cols":9,"rows_kept":24,"cut":false,"hidden":true,"merged":[[1,0,1,2],[1,6,1,8]]}
[]
["Table 2 - Operating Days/Hours by Building Type                                        (pg 118 - 3/14/2014 Protocols)",null,null,null,null,null,"Appendix A - Measure Lives Used in Cost Effectiveness Screening      April 2012"]
["Building Type - For Insulated Holding Cabinents","Days/Year","Hours/Day",null,null,null,"Category","Subcategory","Appliance Lifetime"]
["Education - Primary School",180,8,null,null,null,"Cooking","Combination Oven Steamer Electric",12]
["Education - Secondary School",210,11,null,null,null,"Cooking","Combination Oven Steamer Natural Gas",12]
["Education - Community College",237,16,null,null,null,"Cooking","Convection Oven Electric",12]
["Education - University",192,16,null,null,null,"Cooking","Convection Oven Natural Gas",12]
["Grocery",364,16,null,null,null,"Cooking","Rack Oven Natural Gas",12]
["Medical - Hospital",364,24,null,null,null,"Cooking","Conveyor Oven Natural Gas",12]
["Medical - Clinic",351,12,null,null,null,"Cooking","Fryer Electric",12]
{"$rows_left_out":15}
{"sheet":"Export","index":5,"n_rows":27,"n_cols":25,"rows_kept":27,"cut":false,"hidden":true,"merged":[]}
["Measure Type","Manufacturer","Model","Capacity/Size","Capacity/Size Units","EER Efficiency","SEER Efficiency","Incentive Per Unit","Quantity Committed","Annual Electricity Savings","Peak Demand Reduction","Lifetime Electricity Savings","Annual Gas Savings","Lifetime Gas Savings","Efficiency- other","Efficiency- other-type","Measure ID removed","Quantity Installed","Project in UEZ","Project in OZ","Municipality","K-12 School","County","Affordable Housing","Enhanced Incentive per Unit"]
[{"$f":"IF(Worksheet!$B14<>\"\",VLOOKUP(Worksheet!C14,'Incentive Structure'!$C$4:$D$24,2,FALSE),\"\")","v":""},{"$f":"Worksheet!E14","v":0},{"$f":"Worksheet!F14","v":0},null,null,null,null,{"$f":"Worksheet!Z14","v":0},{"$f":"IF(ISBLANK(Worksheet!X14)=FALSE,Worksheet!X14,\"\")","v":""},{"$f":"IFERROR(IF(ISBLANK(Worksheet!$X14)=FALSE,Worksheet!AF14/Worksheet!$X14,Worksheet!AG14/Worksheet!$Y14),\"\")","v":""},{"$f":"IFERROR(IF(ISBLANK(Worksheet!$X14)=FALSE,Worksheet!AD14/Worksheet!$X14,Worksheet!AE14/Worksheet!$Y14),\"\")","v":""},{"$f":"IFERROR(IF(ISBLANK(Worksheet!$X14)=FALSE,Worksheet!AH14/Worksheet!$X14,Worksheet!AI14/Worksheet!$Y14),\"\")","v":""},{"$f":"IFERROR(IF(ISBLANK(Worksheet!$X14)=FALSE,Worksheet!AJ14/Worksheet!$X14,Worksheet!AK14/Worksheet!$Y14),\"\")","v":""},{"$f":"IFERROR(IF(ISBLANK(Worksheet!$X14)=FALSE,Worksheet!AL14/Worksheet!$X14,Worksheet!AM14/Worksheet!$Y14),\"\")","v":""},null,null,null,{"$f":"IF(ISBLANK(Worksheet!Y14)=FALSE,Worksheet!Y14,\"\")","v":""},{"$f":"IF(Worksheet!$A$10=TRUE,\"Y\",\"N\")","v":"N"},{"$f":"IF(Worksheet!$A$11=TRUE,\"Y\",\"N\")","v":"N"},{"$f":"IF(Worksheet!$B$10=TRUE,\"Y\",\"N\")","v":"N"},{"$f":"IF(Worksheet!$B$11=TRUE,\"Y\",\"N\")","v":"N"},{"$f":"IF(Worksheet!$C$10=TRUE,\"Y\",\"N\")","v":"N"},{"$f":"IF(Worksheet!$C$11=TRUE,\"Y\",\"N\")","v":"N"},{"$f":"IFERROR(Worksheet!AA14,\"\")","v":0}]
[{"$f":"IF(Worksheet!$B15<>\"\",VLOOKUP(Worksheet!C15,'Incentive Structure'!$C$4:$D$24,2,FALSE),\"\")","v":""},{"$f":"Worksheet!E15","v":0},{"$f":"Worksheet!F15","v":0},null,null,null,null,{"$f":"Worksheet!Z15","v":0},{"$f":"IF(ISBLANK(Worksheet!X15)=FALSE,Worksheet!X15,\"\")","v":""},{"$f":"IFERROR(IF(ISBLANK(Worksheet!$X15)=FALSE,Worksheet!AF15/Worksheet!$X15,Worksheet!AG15/Worksheet!$Y15),\"\")","v":""},{"$f":"IFERROR(IF(ISBLANK(Worksheet!$X15)=FALSE,Worksheet!AD15/Worksheet!$X15,Worksheet!AE15/Worksheet!$Y15),\"\")","v":""},{"$f":"IFERROR(IF(ISBLANK(Worksheet!$X15)=FALSE,Worksheet!AH15/Worksheet!$X15,Worksheet!AI15/Worksheet!$Y15),\"\")","v":""},{"$f":"IFERROR(IF(ISBLANK(Worksheet!$X15)=FALSE,Worksheet!AJ15/Worksheet!$X15,Worksheet!AK15/Worksheet!$Y15),\"\")","v":""},{"$f":"IFERROR(IF(ISBLANK(Worksheet!$X15)=FALSE,Worksheet!AL15/Worksheet!$X15,Worksheet!AM15/Worksheet!$Y15),\"\")","v":""},null,null,null,{"$f":"IF(ISBLANK(Worksheet!Y15)=FALSE,Worksheet!Y15,\"\")","v":""},{"$f":"IF(Worksheet!$A$10=TRUE,\"Y\",\"N\")","v":"N"},{"$f":"IF(Worksheet!$A$11=TRUE,\"Y\",\"N\")","v":"N"},{"$f":"IF(Worksheet!$B$10=TRUE,\"Y\",\"N\")","v":"N"},{"$f":"IF(Worksheet!$B$11=TRUE,\"Y\",\"N\")","v":"N"},{"$f":"IF(Worksheet!$C$10=TRUE,\"Y\",\"N\")","v":"N"},{"$f":"IF(Worksheet!$C$11=TRUE,\"Y\",\"N\")","v":"N"},{"$f":"IFERROR(Worksheet!AA15,\"\")","v":0}]
[{"$f":"IF(Worksheet!$B16<>\"\",VLOOKUP(Worksheet!C16,'Incentive Structure'!$C$4:$D$24,2,FALSE),\"\")","v":""},{"$f":"Worksheet!E16","v":0},{"$f":"Worksheet!F16","v":0},null,null,null,null,{"$f":"Worksheet!Z16","v":0},{"$f":"IF(ISBLANK(Worksheet!X16)=FALSE,Worksheet!X16,\"\")","v":""},{"$f":"IFERROR(IF(ISBLANK(Worksheet!$X16)=FALSE,Worksheet!AF16/Worksheet!$X16,Worksheet!AG16/Worksheet!$Y16),\"\")","v":""},{"$f":"IFERROR(IF(ISBLANK(Worksheet!$X16)=FALSE,Worksheet!AD16/Worksheet!$X16,Worksheet!AE16/Worksheet!$Y16),\"\")","v":""},{"$f":"IFERROR(IF(ISBLANK(Worksheet!$X16)=FALSE,Worksheet!AH16/Worksheet!$X16,Worksheet!AI16/Worksheet!$Y16),\"\")","v":""},{"$f":"IFERROR(IF(ISBLANK(Worksheet!$X16)=FALSE,Worksheet!AJ16/Worksheet!$X16,Worksheet!AK16/Worksheet!$Y16),\"\")","v":""},{"$f":"IFERROR(IF(ISBLANK(Worksheet!$X16)=FALSE,Worksheet!AL16/Worksheet!$X16,Worksheet!AM16/Worksheet!$Y16),\"\")","v":""},null,null,null,{"$f":"IF(ISBLANK(Worksheet!Y16)=FALSE,Worksheet!Y16,\"\")","v":""},{"$f":"IF(Worksheet!$A$10=TRUE,\"Y\",\"N\")","v":"N"},{"$f":"IF(Worksheet!$A$11=TRUE,\"Y\",\"N\")","v":"N"},{"$f":"IF(Worksheet!$B$10=TRUE,\"Y\",\"N\")","v":"N"},{"$f":"IF(Worksheet!$B$11=TRUE,\"Y\",\"N\")","v":"N"},{"$f":"IF(Worksheet!$C$10=TRUE,\"Y\",\"N\")","v":"N"},{"$f":"IF(Worksheet!$C$11=TRUE,\"Y\",\"N\")","v":"N"},{"$f":"IFERROR(Worksheet!AA16,\"\")","v":0}]
[{"$f":"IF(Worksheet!$B17<>\"\",VLOOKUP(Worksheet!C17,'Incentive Structure'!$C$4:$D$24,2,FALSE),\"\")","v":""},{"$f":"Worksheet!E17","v":0},{"$f":"Worksheet!F17","v":0},null,null,null,null,{"$f":"Worksheet!Z17","v":0},{"$f":"IF(ISBLANK(Worksheet!X17)=FALSE,Worksheet!X17,\"\")","v":""},{"$f":"IFERROR(IF(ISBLANK(Worksheet!$X17)=FALSE,Worksheet!AF17/Worksheet!$X17,Worksheet!AG17/Worksheet!$Y17),\"\")","v":""},{"$f":"IFERROR(IF(ISBLANK(Worksheet!$X17)=FALSE,Worksheet!AD17/Worksheet!$X17,Worksheet!AE17/Worksheet!$Y17),\"\")","v":""},{"$f":"IFERROR(IF(ISBLANK(Worksheet!$X17)=FALSE,Worksheet!AH17/Worksheet!$X17,Worksheet!AI17/Worksheet!$Y17),\"\")","v":""},{"$f":"IFERROR(IF(ISBLANK(Worksheet!$X17)=FALSE,Worksheet!AJ17/Worksheet!$X17,Worksheet!AK17/Worksheet!$Y17),\"\")","v":""},{"$f":"IFERROR(IF(ISBLANK(Worksheet!$X17)=FALSE,Worksheet!AL17/Worksheet!$X17,Worksheet!AM17/Worksheet!$Y17),\"\")","v":""},null,null,null,{"$f":"IF(ISBLANK(Worksheet!Y17)=FALSE,Worksheet!Y17,\"\")","v":""},{"$f":"IF(Worksheet!$A$10=TRUE,\"Y\",\"N\")","v":"N"},{"$f":"IF(Worksheet!$A$11=TRUE,\"Y\",\"N\")","v":"N"},{"$f":"IF(Worksheet!$B$10=TRUE,\"Y\",\"N\")","v":"N"},{"$f":"IF(Worksheet!$B$11=TRUE,\"Y\",\"N\")","v":"N"},{"$f":"IF(Worksheet!$C$10=TRUE,\"Y\",\"N\")","v":"N"},{"$f":"IF(Worksheet!$C$11=TRUE,\"Y\",\"N\")","v":"N"},{"$f":"IFERROR(Worksheet!AA17,\"\")","v":0}]
[{"$f":"IF(Worksheet!$B18<>\"\",VLOOKUP(Worksheet!C18,'Incentive Structure'!$C$4:$D$24,2,FALSE),\"\")","v":""},{"$f":"Worksheet!E18","v":0},{"$f":"Worksheet!F18","v":0},null,null,null,null,{"$f":"Worksheet!Z18","v":0},{"$f":"IF(ISBLANK(Worksheet!X18)=FALSE,Worksheet!X18,\"\")","v":""},{"$f":"IFERROR(IF(ISBLANK(Worksheet!$X18)=FALSE,Worksheet!AF18/Worksheet!$X18,Worksheet!AG18/Worksheet!$Y18),\"\")","v":""},{"$f":"IFERROR(IF(ISBLANK(Worksheet!$X18)=FALSE,Worksheet!AD18/Worksheet!$X18,Worksheet!AE18/Worksheet!$Y18),\"\")","v":""},{"$f":"IFERROR(IF(ISBLANK(Worksheet!$X18)=FALSE,Worksheet!AH18/Worksheet!$X18,Worksheet!AI18/Worksheet!$Y18),\"\")","v":""},{"$f":"IFERROR(IF(ISBLANK(Worksheet!$X18)=FALSE,Worksheet!AJ18/Worksheet!$X18,Worksheet!AK18/Worksheet!$Y18),\"\")","v":""},{"$f":"IFERROR(IF(ISBLANK(Worksheet!$X18)=FALSE,Worksheet!AL18/Worksheet!$X18,Worksheet!AM18/Worksheet!$Y18),\"\")","v":""},null,null,null,{"$f":"IF(ISBLANK(Worksheet!Y18)=FALSE,Worksheet!Y18,\"\")","v":""},{"$f":"IF(Worksheet!$A$10=TRUE,\"Y\",\"N\")","v":"N"},{"$f":"IF(Worksheet!$A$11=TRUE,\"Y\",\"N\")","v":"N"},{"$f":"IF(Worksheet!$B$10=TRUE,\"Y\",\"N\")","v":"N"},{"$f":"IF(Worksheet!$B$11=TRUE,\"Y\",\"N\")","v":"N"},{"$f":"IF(Worksheet!$C$10=TRUE,\"Y\",\"N\")","v":"N"},{"$f":"IF(Worksheet!$C$11=TRUE,\"Y\",\"N\")","v":"N"},{"$f":"IFERROR(Worksheet!AA18,\"\")","v":0}]
[{"$f":"IF(Worksheet!$B19<>\"\",VLOOKUP(Worksheet!C19,'Incentive Structure'!$C$4:$D$24,2,FALSE),\"\")","v":""},{"$f":"Worksheet!E19","v":0},{"$f":"Worksheet!F19","v":0},null,null,null,null,{"$f":"Worksheet!Z19","v":0},{"$f":"IF(ISBLANK(Worksheet!X19)=FALSE,Worksheet!X19,\"\")","v":""},{"$f":"IFERROR(IF(ISBLANK(Worksheet!$X19)=FALSE,Worksheet!AF19/Worksheet!$X19,Worksheet!AG19/Worksheet!$Y19),\"\")","v":""},{"$f":"IFERROR(IF(ISBLANK(Worksheet!$X19)=FALSE,Worksheet!AD19/Worksheet!$X19,Worksheet!AE19/Worksheet!$Y19),\"\")","v":""},{"$f":"IFERROR(IF(ISBLANK(Worksheet!$X19)=FALSE,Worksheet!AH19/Worksheet!$X19,Worksheet!AI19/Worksheet!$Y19),\"\")","v":""},{"$f":"IFERROR(IF(ISBLANK(Worksheet!$X19)=FALSE,Worksheet!AJ19/Worksheet!$X19,Worksheet!AK19/Worksheet!$Y19),\"\")","v":""},{"$f":"IFERROR(IF(ISBLANK(Worksheet!$X19)=FALSE,Worksheet!AL19/Worksheet!$X19,Worksheet!AM19/Worksheet!$Y19),\"\")","v":""},null,null,null,{"$f":"IF(ISBLANK(Worksheet!Y19)=FALSE,Worksheet!Y19,\"\")","v":""},{"$f":"IF(Worksheet!$A$10=TRUE,\"Y\",\"N\")","v":"N"},{"$f":"IF(Worksheet!$A$11=TRUE,\"Y\",\"N\")","v":"N"},{"$f":"IF(Worksheet!$B$10=TRUE,\"Y\",\"N\")","v":"N"},{"$f":"IF(Worksheet!$B$11=TRUE,\"Y\",\"N\")","v":"N"},{"$f":"IF(Worksheet!$C$10=TRUE,\"Y\",\"N\")","v":"N"},{"$f":"IF(Worksheet!$C$11=TRUE,\"Y\",\"N\")","v":"N"},{"$f":"IFERROR(Worksheet!AA19,\"\")","v":0}]
[{"$f":"IF(Worksheet!$B20<>\"\",VLOOKUP(Worksheet!C20,'Incentive Structure'!$C$4:$D$24,2,FALSE),\"\")","v":""},{"$f":"Worksheet!E20","v":0},{"$f":"Worksheet!F20","v":0},null,null,null,null,{"$f":"Worksheet!Z20","v":0},{"$f":"IF(ISBLANK(Worksheet!X20)=FALSE,Worksheet!X20,\"\")","v":""},{"$f":"IFERROR(IF(ISBLANK(Worksheet!$X20)=FALSE,Worksheet!AF20/Worksheet!$X20,Worksheet!AG20/Worksheet!$Y20),\"\")","v":""},{"$f":"IFERROR(IF(ISBLANK(Worksheet!$X20)=FALSE,Worksheet!AD20/Worksheet!$X20,Worksheet!AE20/Worksheet!$Y20),\"\")","v":""},{"$f":"IFERROR(IF(ISBLANK(Worksheet!$X20)=FALSE,Worksheet!AH20/Worksheet!$X20,Worksheet!AI20/Worksheet!$Y20),\"\")","v":""},{"$f":"IFERROR(IF(ISBLANK(Worksheet!$X20)=FALSE,Worksheet!AJ20/Worksheet!$X20,Worksheet!AK20/Worksheet!$Y20),\"\")","v":""},{"$f":"IFERROR(IF(ISBLANK(Worksheet!$X20)=FALSE,Worksheet!AL20/Worksheet!$X20,Worksheet!AM20/Worksheet!$Y20),\"\")","v":""},null,null,null,{"$f":"IF(ISBLANK(Worksheet!Y20)=FALSE,Worksheet!Y20,\"\")","v":""},{"$f":"IF(Worksheet!$A$10=TRUE,\"Y\",\"N\")","v":"N"},{"$f":"IF(Worksheet!$A$11=TRUE,\"Y\",\"N\")","v":"N"},{"$f":"IF(Worksheet!$B$10=TRUE,\"Y\",\"N\")","v":"N"},{"$f":"IF(Worksheet!$B$11=TRUE,\"Y\",\"N\")","v":"N"},{"$f":"IF(Worksheet!$C$10=TRUE,\"Y\",\"N\")","v":"N"},{"$f":"IF(Worksheet!$C$11=TRUE,\"Y\",\"N\")","v":"N"},{"$f":"IFERROR(Worksheet!AA20,\"\")","v":0}]
[{"$f":"IF(Worksheet!$B21<>\"\",VLOOKUP(Worksheet!C21,'Incentive Structure'!$C$4:$D$24,2,FALSE),\"\")","v":""},{"$f":"Worksheet!E21","v":0},{"$f":"Worksheet!F21","v":0},null,null,null,null,{"$f":"Worksheet!Z21","v":0},{"$f":"IF(ISBLANK(Worksheet!X21)=FALSE,Worksheet!X21,\"\")","v":""},{"$f":"IFERROR(IF(ISBLANK(Worksheet!$X21)=FALSE,Worksheet!AF21/Worksheet!$X21,Worksheet!AG21/Worksheet!$Y21),\"\")","v":""},{"$f":"IFERROR(IF(ISBLANK(Worksheet!$X21)=FALSE,Worksheet!AD21/Worksheet!$X21,Worksheet!AE21/Worksheet!$Y21),\"\")","v":""},{"$f":"IFERROR(IF(ISBLANK(Worksheet!$X21)=FALSE,Worksheet!AH21/Worksheet!$X21,Worksheet!AI21/Worksheet!$Y21),\"\")","v":""},{"$f":"IFERROR(IF(ISBLANK(Worksheet!$X21)=FALSE,Worksheet!AJ21/Worksheet!$X21,Worksheet!AK21/Worksheet!$Y21),\"\")","v":""},{"$f":"IFERROR(IF(ISBLANK(Worksheet!$X21)=FALSE,Worksheet!AL21/Worksheet!$X21,Worksheet!AM21/Worksheet!$Y21),\"\")","v":""},null,null,null,{"$f":"IF(ISBLANK(Worksheet!Y21)=FALSE,Worksheet!Y21,\"\")","v":""},{"$f":"IF(Worksheet!$A$10=TRUE,\"Y\",\"N\")","v":"N"},{"$f":"IF(Worksheet!$A$11=TRUE,\"Y\",\"N\")","v":"N"},{"$f":"IF(Worksheet!$B$10=TRUE,\"Y\",\"N\")","v":"N"},{"$f":"IF(Worksheet!$B$11=TRUE,\"Y\",\"N\")","v":"N"},{"$f":"IF(Worksheet!$C$10=TRUE,\"Y\",\"N\")","v":"N"},{"$f":"IF(Worksheet!$C$11=TRUE,\"Y\",\"N\")","v":"N"},{"$f":"IFERROR(Worksheet!AA21,\"\")","v":0}]
[{"$f":"IF(Worksheet!$B22<>\"\",VLOOKUP(Worksheet!C22,'Incentive Structure'!$C$4:$D$24,2,FALSE),\"\")","v":""},{"$f":"Worksheet!E22","v":0},{"$f":"Worksheet!F22","v":0},null,null,null,null,{"$f":"Worksheet!Z22","v":0},{"$f":"IF(ISBLANK(Worksheet!X22)=FALSE,Worksheet!X22,\"\")","v":""},{"$f":"IFERROR(IF(ISBLANK(Worksheet!$X22)=FALSE,Worksheet!AF22/Worksheet!$X22,Worksheet!AG22/Worksheet!$Y22),\"\")","v":""},{"$f":"IFERROR(IF(ISBLANK(Worksheet!$X22)=FALSE,Worksheet!AD22/Worksheet!$X22,Worksheet!AE22/Worksheet!$Y22),\"\")","v":""},{"$f":"IFERROR(IF(ISBLANK(Worksheet!$X22)=FALSE,Worksheet!AH22/Worksheet!$X22,Worksheet!AI22/Worksheet!$Y22),\"\")","v":""},{"$f":"IFERROR(IF(ISBLANK(Worksheet!$X22)=FALSE,Worksheet!AJ22/Worksheet!$X22,Worksheet!AK22/Worksheet!$Y22),\"\")","v":""},{"$f":"IFERROR(IF(ISBLANK(Worksheet!$X22)=FALSE,Worksheet!AL22/Worksheet!$X22,Worksheet!AM22/Worksheet!$Y22),\"\")","v":""},null,null,null,{"$f":"IF(ISBLANK(Worksheet!Y22)=FALSE,Worksheet!Y22,\"\")","v":""},{"$f":"IF(Worksheet!$A$10=TRUE,\"Y\",\"N\")","v":"N"},{"$f":"IF(Worksheet!$A$11=TRUE,\"Y\",\"N\")","v":"N"},{"$f":"IF(Worksheet!$B$10=TRUE,\"Y\",\"N\")","v":"N"},{"$f":"IF(Worksheet!$B$11=TRUE,\"Y\",\"N\")","v":"N"},{"$f":"IF(Worksheet!$C$10=TRUE,\"Y\",\"N\")","v":"N"},{"$f":"IF(Worksheet!$C$11=TRUE,\"Y\",\"N\")","v":"N"},{"$f":"IFERROR(Worksheet!AA22,\"\")","v":0}]
{"$rows_left_out":18}
{"sheet":"Version","index":6,"n_rows":10,"n_cols":2,"rows_kept":10,"cut":false,"hidden":true,"merged":[]}
[14,"<- Version"]
[]
["Log"]
["2013-04-23","Updated with more granular measure breakdown per AEG's measures"]
["2013-07-09","no change for V7, skipped V6"]
["2013-07-16","fixed incentive lookup table to distinguish between different types of cooling applications"]
["2013-09-19","fixed incentive lookup table which had lots of mistakes in the cooking section"]
["2018-06-26","Updated to align with FY19 Protocols"]
["2019-07-01","Added Enhanced Incentive Eligibility Section and Updated for FY20 Program"]
["2020-10-01","Updated for FY21 Program"]